Compose ID Family Architecture Release Type Status Created Last updated Link
Fedora-Atomic-24-20161025.0 Atomic x86_64 24 qcow2 Failed 2016-10-25 05:52:24 2016-10-25 05:54:25 Download Image
Result file at: /tmp/tmpm3Yf9a
Created /tmp/tmpLX_yq2
Generating SSH keys
Created /tmp/tmpZ7yl85
/usr/bin/qemu-kvm -m 2048 -smp 1 -drive file=/tmp/tmpZ7yl85/Fedora-Atomic-24-20161025.0.x86_64.qcow2,if=virtio -drive file=/tmp/tmpZ7yl85/seed.img,if=virtio -net bridge,br=virbr0 -net nic,macaddr=00:16:3e:0e:ea:28,model=virtio -display none
Successfully booted your local cloud image!
We will wait for 45 seconds for the image to boot up.
 
Try 0 failed for IP injection to /etc/hosts.
Executing command: sudo sh -c 'echo -e "\n10.5.126.23 infrastructure.fedoraproject.org\n10.5.125.44	pkgs.fedoraproject.org	pkgs\n10.5.126.51	download.fedora.redhat.com\n10.5.125.63	koji.fedoraproject.org\n10.5.126.51 mirrors.fedoraproject.org\n10.5.125.36	kojipkgs.fedoraproject.org" >> /etc/hosts'
Executing command: curl -O http://infrastructure.fedoraproject.org/infra/autocloud/tunirtests.tar.gz
Executing command: tar -xzvf tunirtests.tar.gz
Executing command: ## sudo python3 -m unittest tunirtests.nongatingtests.TunirNonGatingtests -v
Executing command: ## sudo python3 -m unittest tunirtests.nongatingtests.TunirNonGatingtestBzip2 -v
Executing command: ## sudo python3 -m unittest tunirtests.nongatingtests.TunirNonGatingtestsCpio -v
Executing command: ## sudo python3 -m unittest tunirtests.nongatingtests.TunirNonGatingtestDiffutills -v
Executing command: ## sudo python3 -m unittest tunirtests.nongatingtests.TunirNonGatingtestaudit -v
Executing command: ## sudo python3 -m unittest tunirtests.selinux.TestSELinux -v
Executing command: ## sudo python3 -m unittest tunirtests.sshkeygentest.sshkeygenTest -v
Executing command: ## sudo python3 -m unittest tunirtests.testumountroot.TestUmountRoot -v
Executing command: sudo python3 -m unittest tunirtests.cloudtests.TestBase -v
Executing command: sudo python3 -m unittest tunirtests.cloudtests.TestCloudtmp -v
Executing command: sudo python3 -m unittest tunirtests.cloudtests.Testtmpmount -v
Executing command: sudo python3 -m unittest tunirtests.cloudtests.Testnetname -v
Executing command: ## python3 -m unittest tunirtests.cloudtests.TestJournalWritten -v
Executing command: sudo systemctl stop chronyd.service

                  

                  
Job status: False

                  

                  
command: sudo sh -c 'echo -e "\n10.5.126.23 infrastructure.fedoraproject.org\n10.5.125.44	pkgs.fedoraproject.org	pkgs\n10.5.126.51	download.fedora.redhat.com\n10.5.125.63	koji.fedoraproject.org\n10.5.126.51 mirrors.fedoraproject.org\n10.5.125.36	kojipkgs.fedoraproject.org" >> /etc/hosts'
status: True

                  

                  

                  

                  
command: curl -O http://infrastructure.fedoraproject.org/infra/autocloud/tunirtests.tar.gz
status: True

                  
  % Total    % Received % Xferd  Average Speed   Time    Time     Time  Current
                                 Dload  Upload   Total   Spent    Left  Speed
  0     0    0     0    0     0      0      0 --:--:-- --:--:-- --:--:--     0
100 12362  100 12362    0     0   938k      0 --:--:-- --:--:-- --:--:-- 1006k

                  

                  

                  
command: tar -xzvf tunirtests.tar.gz
status: True

                  
tunirtests/
tunirtests/atomictests.py
tunirtests/cloudservice.py
tunirtests/cloudtests.py
tunirtests/__init__.py
tunirtests/loopbacktest.py
tunirtests/nongatingtests.py
tunirtests/selinux.py
tunirtests/sshkeygentest.py
tunirtests/testreboot.py
tunirtests/testumountroot.py
tunirtests/testutils.py
tunirtests/LICENSE

                  

                  

                  
command: ## sudo python3 -m unittest tunirtests.nongatingtests.TunirNonGatingtests -v
status: True

                  
test_bash (tunirtests.nongatingtests.TunirNonGatingtests)
Tests the bash version as the same of upstream ... ok

                  
----------------------------------------------------------------------
Ran 1 test in 0.004s

                  
OK

                  

                  

                  
command: ## sudo python3 -m unittest tunirtests.nongatingtests.TunirNonGatingtestBzip2 -v
status: True

                  
test_bzip2 (tunirtests.nongatingtests.TunirNonGatingtestBzip2)
Test to run a file through bzip2,bzcat,bunzip2 ... ok

                  
----------------------------------------------------------------------
Ran 1 test in 0.018s

                  
OK

                  

                  

                  
command: ## sudo python3 -m unittest tunirtests.nongatingtests.TunirNonGatingtestsCpio -v
status: True

                  
test_cpio (tunirtests.nongatingtests.TunirNonGatingtestsCpio)
Tests to check basic cpio functions ... ok

                  
----------------------------------------------------------------------
Ran 1 test in 0.042s

                  
OK

                  

                  

                  
command: ## sudo python3 -m unittest tunirtests.nongatingtests.TunirNonGatingtestDiffutills -v
status: True

                  
test_cmp (tunirtests.nongatingtests.TunirNonGatingtestDiffutills)
Test to check cmp functionality ... ok

                  
----------------------------------------------------------------------
Ran 1 test in 0.033s

                  
OK

                  

                  

                  
command: ## sudo python3 -m unittest tunirtests.nongatingtests.TunirNonGatingtestaudit -v
status: True

                  
test_audit (tunirtests.nongatingtests.TunirNonGatingtestaudit)
Tests audit ... ok

                  
----------------------------------------------------------------------
Ran 1 test in 0.456s

                  
OK

                  

                  

                  
command: ## sudo python3 -m unittest tunirtests.selinux.TestSELinux -v
status: True

                  
test_selinux (tunirtests.selinux.TestSELinux) ... ok

                  
----------------------------------------------------------------------
Ran 1 test in 0.015s

                  
OK

                  

                  

                  
command: ## sudo python3 -m unittest tunirtests.sshkeygentest.sshkeygenTest -v
status: True

                  
test_sshkeygen (tunirtests.sshkeygentest.sshkeygenTest)
This is a test case for ssh-keygen command. ... ok

                  
----------------------------------------------------------------------
Ran 1 test in 0.084s

                  
OK

                  

                  

                  
command: ## sudo python3 -m unittest tunirtests.testumountroot.TestUmountRoot -v
status: True

                  
test_umountroot (tunirtests.testumountroot.TestUmountRoot) ... ok

                  
----------------------------------------------------------------------
Ran 1 test in 0.012s

                  
OK

                  

                  

                  
command: sudo python3 -m unittest tunirtests.cloudtests.TestBase -v
status: True

                  
test_logging (tunirtests.cloudtests.TestBase)
Tests journald logging ... ok
test_packageinstall (tunirtests.cloudtests.TestBase)
Tests package install using dnf ... skipped 'It is an Atomic image.'
test_selinux (tunirtests.cloudtests.TestBase)
Tests the SELinux ... ok
test_services (tunirtests.cloudtests.TestBase)
No service should fail in the startup. ... ok

                  
----------------------------------------------------------------------
Ran 4 tests in 0.046s

                  
OK (skipped=1)

                  

                  

                  
command: sudo python3 -m unittest tunirtests.cloudtests.TestCloudtmp -v
status: True

                  
test_write_tmp (tunirtests.cloudtests.TestCloudtmp)
/tmp should always be writable. ... ok

                  
----------------------------------------------------------------------
Ran 1 test in 0.005s

                  
OK

                  

                  

                  
command: sudo python3 -m unittest tunirtests.cloudtests.Testtmpmount -v
status: True

                  
test_tmp_mount (tunirtests.cloudtests.Testtmpmount) ... ok

                  
----------------------------------------------------------------------
Ran 1 test in 0.004s

                  
OK

                  

                  

                  
command: sudo python3 -m unittest tunirtests.cloudtests.Testnetname -v
status: True

                  
test_net_name (tunirtests.cloudtests.Testnetname) ... skipped 'Image is using predictable naming convention.'

                  
----------------------------------------------------------------------
Ran 1 test in 0.001s

                  
OK (skipped=1)

                  

                  

                  
command: ## python3 -m unittest tunirtests.cloudtests.TestJournalWritten -v
status: False

                  
test_journal_written (tunirtests.cloudtests.TestJournalWritten) ... FAIL

                  
======================================================================
FAIL: test_journal_written (tunirtests.cloudtests.TestJournalWritten)
----------------------------------------------------------------------
Traceback (most recent call last):
  File "/var/home/fedora/tunirtests/cloudtests.py", line 91, in test_journal_written
    self.assertIn('/var/log/journal/{0}/system.journal'.format(mid), out)
AssertionError: '/var/log/journal/264ebf53fe3d4e07a2fef42b47167053/system.journal' not found in 'lrwx------. 1 root root 64 Oct 25 05:53 16 -> /run/log/journal/264ebf53fe3d4e07a2fef42b47167053/system.journal\n'

                  
----------------------------------------------------------------------
Ran 1 test in 0.038s

                  
FAILED (failures=1)

                  

                  

                  
command: sudo systemctl stop chronyd.service
status: False

                  
Failed to stop chronyd.service: Unit chronyd.service not loaded.

                  

                  

                  

                  

                  

                  
Non gating tests status:
Total:9
Passed:8
Failed:1
: WARNING: Image format was not specified for '/tmp/tmpZ7yl85/seed.img' and probing guessed raw.
         Automatically detecting the format is dangerous for raw images, write operations on block 0 will be restricted.
         Specify the 'raw' format explicitly to remove the restrictions.
stty: standard input: Inappropriate ioctl for device