Compose ID Family Architecture Release Type Status Created Last updated Link
Fedora-Rawhide-20181203.n.0 Atomic x86_64 Rawhide qcow2 Failed 2018-12-03 10:46:01 2018-12-03 10:47:51 Download Image
Result file at: /tmp/tmpohfiom
Created /tmp/tmpGnAIfi
Generating SSH keys
Created /tmp/tmprhwdWv
/usr/bin/qemu-kvm -m 2048 -smp 2 -drive file=/tmp/tmprhwdWv/Fedora-AtomicHost-Rawhide-20181203.n.0.x86_64.qcow2,if=virtio -drive file=/tmp/tmprhwdWv/seed.img,if=virtio -net bridge,br=virbr0 -net nic,macaddr=00:16:3e:74:d9:4c,model=virtio -device virtio-rng-pci -display none
Successfully booted your local cloud image!
We will wait for 45 seconds for the image to boot up.
 
Executing command: sudo sh -c 'echo -e "\n10.5.126.23 infrastructure.fedoraproject.org\n10.5.125.44	pkgs.fedoraproject.org	pkgs\n10.5.126.51	download.fedora.redhat.com\n10.5.125.63	koji.fedoraproject.org\n10.5.126.51 mirrors.fedoraproject.org\n10.5.125.36	kojipkgs.fedoraproject.org" >> /etc/hosts'
Executing command: curl -O http://infrastructure.fedoraproject.org/infra/autocloud/tunirtests.tar.gz
Executing command: tar -xzvf tunirtests.tar.gz
Executing command: sudo python3 -m unittest tunirtests.atomictests.TestAtomic01Status -v
Executing command: ## sudo python3 -m unittest tunirtests.nongatingtests.TunirNonGatingtests -v
Executing command: ## sudo python3 -m unittest tunirtests.nongatingtests.TunirNonGatingtestBzip2 -v
Executing command: ## sudo python3 -m unittest tunirtests.nongatingtests.TunirNonGatingtestsCpio -v
Executing command: ## sudo python3 -m unittest tunirtests.nongatingtests.TunirNonGatingtestDiffutills -v
Executing command: ## sudo python3 -m unittest tunirtests.nongatingtests.TunirNonGatingtestaudit -v
Executing command: ## sudo python3 -m unittest tunirtests.selinux.TestSELinux -v
Executing command: ## sudo python3 -m unittest tunirtests.sshkeygentest.sshkeygenTest -v
Executing command: ## sudo python3 -m unittest tunirtests.testumountroot.TestUmountRoot -v
Executing command: sudo python3 -m unittest tunirtests.cloudtests.TestBase -v
Executing command: sudo python3 -m unittest tunirtests.cloudtests.TestCloudtmp -v
Executing command: sudo python3 -m unittest tunirtests.cloudtests.Testtmpmount -v
Executing command: sudo python3 -m unittest tunirtests.cloudtests.Testnetname -v
Executing command: ## python3 -m unittest tunirtests.cloudtests.TestJournalWritten -v
Executing command: sudo python3 -m unittest tunirtests.cloudservice.TestServiceStop -v
Executing command: sudo python3 -m unittest tunirtests.cloudservice.TestServiceDisable -v
Executing command: @@ sudo reboot
Polling for SSH connection
Polling for SSH connection
Executing command: ## sudo python3 -m unittest tunirtests.testreboot.TestReboot -v
Executing command: sudo python3 -m unittest tunirtests.cloudservice.TestServiceManipulation -v
Executing command: ## python3 -m unittest tunirtests.cloudtests.TestJournalWrittenAfterReboot -v
Executing command: @@ sudo reboot
Polling for SSH connection
Executing command: sudo python3 -m unittest tunirtests.cloudservice.TestServiceAfter -v
[Errno None] Unable to connect to port 22 on 192.168.122.211

                  

                  
Job status: False

                  

                  
command: sudo sh -c 'echo -e "\n10.5.126.23 infrastructure.fedoraproject.org\n10.5.125.44	pkgs.fedoraproject.org	pkgs\n10.5.126.51	download.fedora.redhat.com\n10.5.125.63	koji.fedoraproject.org\n10.5.126.51 mirrors.fedoraproject.org\n10.5.125.36	kojipkgs.fedoraproject.org" >> /etc/hosts'
status: True

                  

                  

                  

                  
command: curl -O http://infrastructure.fedoraproject.org/infra/autocloud/tunirtests.tar.gz
status: True

                  
  % Total    % Received % Xferd  Average Speed   Time    Time     Time  Current
                                 Dload  Upload   Total   Spent    Left  Speed
  0     0    0     0    0     0      0      0 --:--:-- --:--:-- --:--:--     0
100 12885  100 12885    0     0  1797k      0 --:--:-- --:--:-- --:--:-- 2097k

                  

                  

                  
command: tar -xzvf tunirtests.tar.gz
status: True

                  
tunirtests/
tunirtests/atomictests.py
tunirtests/cloudservice.py
tunirtests/cloudtests.py
tunirtests/__init__.py
tunirtests/loopbacktest.py
tunirtests/nongatingtests.py
tunirtests/selinux.py
tunirtests/sshkeygentest.py
tunirtests/testreboot.py
tunirtests/testumountroot.py
tunirtests/testutils.py
tunirtests/vagranttests.py
tunirtests/LICENSE

                  

                  

                  
command: sudo python3 -m unittest tunirtests.atomictests.TestAtomic01Status -v
status: True

                  
test_print_status (tunirtests.atomictests.TestAtomic01Status)
Print the rpm-ostree status ... State: idle
AutomaticUpdates: disabled
Deployments:
 ostree://fedora-atomic:fedora/rawhide/x86_64/atomic-host
                   Version: Rawhide.20181203.n.0 (2018-12-03T06:47:36Z)
                    Commit: 3f19019047eb59b280e5bb4fba20c8dbb7cec90fd8df9cc1d0fca95adf2c9919
              GPGSignature: Valid signature by F1D8EC98F241AAF20DF69420EF3C111FCFC659B9

                  
ok

                  
----------------------------------------------------------------------
Ran 1 test in 0.155s

                  
OK

                  

                  

                  
command: ## sudo python3 -m unittest tunirtests.nongatingtests.TunirNonGatingtests -v
status: True

                  
test_bash (tunirtests.nongatingtests.TunirNonGatingtests)
Tests the bash version as the same of upstream ... ok

                  
----------------------------------------------------------------------
Ran 1 test in 0.008s

                  
OK

                  

                  

                  
command: ## sudo python3 -m unittest tunirtests.nongatingtests.TunirNonGatingtestBzip2 -v
status: True

                  
test_bzip2 (tunirtests.nongatingtests.TunirNonGatingtestBzip2)
Test to run a file through bzip2,bzcat,bunzip2 ... ok

                  
----------------------------------------------------------------------
Ran 1 test in 0.031s

                  
OK

                  

                  

                  
command: ## sudo python3 -m unittest tunirtests.nongatingtests.TunirNonGatingtestsCpio -v
status: True

                  
test_cpio (tunirtests.nongatingtests.TunirNonGatingtestsCpio)
Tests to check basic cpio functions ... ok

                  
----------------------------------------------------------------------
Ran 1 test in 0.063s

                  
OK

                  

                  

                  
command: ## sudo python3 -m unittest tunirtests.nongatingtests.TunirNonGatingtestDiffutills -v
status: False

                  
test_cmp (tunirtests.nongatingtests.TunirNonGatingtestDiffutills)
Test to check cmp functionality ... FAIL

                  
======================================================================
FAIL: test_cmp (tunirtests.nongatingtests.TunirNonGatingtestDiffutills)
Test to check cmp functionality
----------------------------------------------------------------------
Traceback (most recent call last):
  File "/var/home/fedora/tunirtests/nongatingtests.py", line 99, in test_cmp
    self.assertIn(' line 1 is 170 x 163 s', out, out+err)
AssertionError: ' line 1 is 170 x 163 s' not found in '/var/tmp/diffutilsa /var/tmp/diffutilsb differ: byte 16, line 1 is  12 ^J 163 s\n' : /var/tmp/diffutilsa /var/tmp/diffutilsb differ: byte 16, line 1 is  12 ^J 163 s

                  

                  
----------------------------------------------------------------------
Ran 1 test in 0.033s

                  
FAILED (failures=1)

                  

                  

                  
command: ## sudo python3 -m unittest tunirtests.nongatingtests.TunirNonGatingtestaudit -v
status: True

                  
test_audit (tunirtests.nongatingtests.TunirNonGatingtestaudit)
Tests audit ... ok

                  
----------------------------------------------------------------------
Ran 1 test in 0.292s

                  
OK

                  

                  

                  
command: ## sudo python3 -m unittest tunirtests.selinux.TestSELinux -v
status: True

                  
test_selinux (tunirtests.selinux.TestSELinux) ... ok

                  
----------------------------------------------------------------------
Ran 1 test in 0.036s

                  
OK

                  

                  

                  
command: ## sudo python3 -m unittest tunirtests.sshkeygentest.sshkeygenTest -v
status: True

                  
test_sshkeygen (tunirtests.sshkeygentest.sshkeygenTest)
This is a test case for ssh-keygen command. ... ok

                  
----------------------------------------------------------------------
Ran 1 test in 0.077s

                  
OK

                  

                  

                  
command: ## sudo python3 -m unittest tunirtests.testumountroot.TestUmountRoot -v
status: True

                  
test_umountroot (tunirtests.testumountroot.TestUmountRoot) ... ok

                  
----------------------------------------------------------------------
Ran 1 test in 0.060s

                  
OK

                  

                  

                  
command: sudo python3 -m unittest tunirtests.cloudtests.TestBase -v
status: True

                  
test_logging (tunirtests.cloudtests.TestBase)
Tests journald logging ... ok
test_packageinstall (tunirtests.cloudtests.TestBase)
Tests package install using dnf ... skipped 'It is an Atomic image.'
test_selinux (tunirtests.cloudtests.TestBase)
Tests the SELinux ... ok
test_services (tunirtests.cloudtests.TestBase)
No service should fail in the startup. ... ok

                  
----------------------------------------------------------------------
Ran 4 tests in 0.142s

                  
OK (skipped=1)

                  

                  

                  
command: sudo python3 -m unittest tunirtests.cloudtests.TestCloudtmp -v
status: True

                  
test_write_tmp (tunirtests.cloudtests.TestCloudtmp)
/tmp should always be writable. ... ok

                  
----------------------------------------------------------------------
Ran 1 test in 0.003s

                  
OK

                  

                  

                  
command: sudo python3 -m unittest tunirtests.cloudtests.Testtmpmount -v
status: True

                  
test_tmp_mount (tunirtests.cloudtests.Testtmpmount) ... ok

                  
----------------------------------------------------------------------
Ran 1 test in 0.008s

                  
OK

                  

                  

                  
command: sudo python3 -m unittest tunirtests.cloudtests.Testnetname -v
status: True

                  
test_net_name (tunirtests.cloudtests.Testnetname) ... ok

                  
----------------------------------------------------------------------
Ran 1 test in 0.009s

                  
OK

                  

                  

                  
command: ## python3 -m unittest tunirtests.cloudtests.TestJournalWritten -v
status: True

                  
test_journal_written (tunirtests.cloudtests.TestJournalWritten) ... ok

                  
----------------------------------------------------------------------
Ran 1 test in 0.098s

                  
OK

                  

                  

                  
command: sudo python3 -m unittest tunirtests.cloudservice.TestServiceStop -v
status: True

                  
test_service (tunirtests.cloudservice.TestServiceStop) ... ok

                  
----------------------------------------------------------------------
Ran 1 test in 0.037s

                  
OK

                  

                  

                  
command: sudo python3 -m unittest tunirtests.cloudservice.TestServiceDisable -v
status: True

                  
test_service (tunirtests.cloudservice.TestServiceDisable) ... ok

                  
----------------------------------------------------------------------
Ran 1 test in 0.481s

                  
OK

                  

                  

                  
command: @@ sudo reboot
status: True

                  

                  

                  

                  
command: ## sudo python3 -m unittest tunirtests.testreboot.TestReboot -v
status: True

                  
test_lastreboot (tunirtests.testreboot.TestReboot)
Checks for system reboot. ... ok

                  
----------------------------------------------------------------------
Ran 1 test in 0.014s

                  
OK

                  

                  

                  
command: sudo python3 -m unittest tunirtests.cloudservice.TestServiceManipulation -v
status: True

                  
test_service (tunirtests.cloudservice.TestServiceManipulation)
Tests the service. ... ok

                  
----------------------------------------------------------------------
Ran 1 test in 0.740s

                  
OK

                  

                  

                  
command: ## python3 -m unittest tunirtests.cloudtests.TestJournalWrittenAfterReboot -v
status: True

                  
test_journal_written_after_reboot (tunirtests.cloudtests.TestJournalWrittenAfterReboot) ... ok

                  
----------------------------------------------------------------------
Ran 1 test in 0.110s

                  
OK

                  

                  

                  

                  

                  

                  
Non gating tests status:
Total:11
Passed:10
Failed:1
: WARNING: Image format was not specified for '/tmp/tmprhwdWv/seed.img' and probing guessed raw.
         Automatically detecting the format is dangerous for raw images, write operations on block 0 will be restricted.
         Specify the 'raw' format explicitly to remove the restrictions.
stty: 'standard input': Inappropriate ioctl for device