Compose ID Family Architecture Release Type Status Created Last updated Link
Fedora-Rawhide-20190211.n.0 Base x86_64 Rawhide qcow2 Failed 2019-02-11 08:47:26 2019-02-11 08:50:31 Download Image
Result file at: /tmp/tmpkGN16L
Created /tmp/tmpKGzxoJ
Generating SSH keys
Created /tmp/tmpiV0Ocu
/usr/bin/qemu-kvm -m 2048 -smp 2 -drive file=/tmp/tmpiV0Ocu/Fedora-Cloud-Base-Rawhide-20190211.n.0.x86_64.qcow2,if=virtio -drive file=/tmp/tmpiV0Ocu/seed.img,if=virtio -net bridge,br=virbr0 -net nic,macaddr=00:16:3e:44:4e:c5,model=virtio -device virtio-rng-pci -display none
Successfully booted your local cloud image!
We will wait for 45 seconds for the image to boot up.
 
Executing command: sudo sh -c 'echo -e "\n10.5.126.23 infrastructure.fedoraproject.org\n10.5.125.44	pkgs.fedoraproject.org	pkgs\n10.5.126.51	download.fedora.redhat.com\n10.5.125.63	koji.fedoraproject.org\n10.5.126.51 mirrors.fedoraproject.org\n10.5.125.36	kojipkgs.fedoraproject.org" >> /etc/hosts'
Executing command: curl -O http://infrastructure.fedoraproject.org/infra/autocloud/tunirtests.tar.gz
Executing command: tar -xzvf tunirtests.tar.gz
Executing command: sudo python3 -m unittest tunirtests.atomictests.TestAtomic01Status -v
Executing command: ## sudo python3 -m unittest tunirtests.nongatingtests.TunirNonGatingtests -v
Executing command: ## sudo python3 -m unittest tunirtests.nongatingtests.TunirNonGatingtestBzip2 -v
Executing command: ## sudo python3 -m unittest tunirtests.nongatingtests.TunirNonGatingtestsCpio -v
Executing command: ## sudo python3 -m unittest tunirtests.nongatingtests.TunirNonGatingtestDiffutills -v
Executing command: ## sudo python3 -m unittest tunirtests.nongatingtests.TunirNonGatingtestaudit -v
Executing command: ## sudo python3 -m unittest tunirtests.selinux.TestSELinux -v
Executing command: ## sudo python3 -m unittest tunirtests.sshkeygentest.sshkeygenTest -v
Executing command: ## sudo python3 -m unittest tunirtests.testumountroot.TestUmountRoot -v
Executing command: sudo python3 -m unittest tunirtests.cloudtests.TestBase -v

                  

                  
Job status: False

                  

                  
command: sudo sh -c 'echo -e "\n10.5.126.23 infrastructure.fedoraproject.org\n10.5.125.44	pkgs.fedoraproject.org	pkgs\n10.5.126.51	download.fedora.redhat.com\n10.5.125.63	koji.fedoraproject.org\n10.5.126.51 mirrors.fedoraproject.org\n10.5.125.36	kojipkgs.fedoraproject.org" >> /etc/hosts'
status: True

                  

                  

                  

                  
command: curl -O http://infrastructure.fedoraproject.org/infra/autocloud/tunirtests.tar.gz
status: True

                  
  % Total    % Received % Xferd  Average Speed   Time    Time     Time  Current
                                 Dload  Upload   Total   Spent    Left  Speed
  0     0    0     0    0     0      0      0 --:--:-- --:--:-- --:--:--     0
100 12885  100 12885    0     0  1797k      0 --:--:-- --:--:-- --:--:-- 1797k

                  

                  

                  
command: tar -xzvf tunirtests.tar.gz
status: True

                  
tunirtests/
tunirtests/atomictests.py
tunirtests/cloudservice.py
tunirtests/cloudtests.py
tunirtests/__init__.py
tunirtests/loopbacktest.py
tunirtests/nongatingtests.py
tunirtests/selinux.py
tunirtests/sshkeygentest.py
tunirtests/testreboot.py
tunirtests/testumountroot.py
tunirtests/testutils.py
tunirtests/vagranttests.py
tunirtests/LICENSE

                  

                  

                  
command: sudo python3 -m unittest tunirtests.atomictests.TestAtomic01Status -v
status: True

                  
test_print_status (tunirtests.atomictests.TestAtomic01Status)
Print the rpm-ostree status ... skipped "It's not an atomic image"

                  
----------------------------------------------------------------------
Ran 1 test in 0.001s

                  
OK (skipped=1)

                  

                  

                  
command: ## sudo python3 -m unittest tunirtests.nongatingtests.TunirNonGatingtests -v
status: True

                  
test_bash (tunirtests.nongatingtests.TunirNonGatingtests)
Tests the bash version as the same of upstream ... ok

                  
----------------------------------------------------------------------
Ran 1 test in 0.009s

                  
OK

                  

                  

                  
command: ## sudo python3 -m unittest tunirtests.nongatingtests.TunirNonGatingtestBzip2 -v
status: True

                  
test_bzip2 (tunirtests.nongatingtests.TunirNonGatingtestBzip2)
Test to run a file through bzip2,bzcat,bunzip2 ... ok

                  
----------------------------------------------------------------------
Ran 1 test in 0.026s

                  
OK

                  

                  

                  
command: ## sudo python3 -m unittest tunirtests.nongatingtests.TunirNonGatingtestsCpio -v
status: True

                  
test_cpio (tunirtests.nongatingtests.TunirNonGatingtestsCpio)
Tests to check basic cpio functions ... ok

                  
----------------------------------------------------------------------
Ran 1 test in 0.066s

                  
OK

                  

                  

                  
command: ## sudo python3 -m unittest tunirtests.nongatingtests.TunirNonGatingtestDiffutills -v
status: True

                  
test_cmp (tunirtests.nongatingtests.TunirNonGatingtestDiffutills)
Test to check cmp functionality ... ok

                  
----------------------------------------------------------------------
Ran 1 test in 0.064s

                  
OK

                  

                  

                  
command: ## sudo python3 -m unittest tunirtests.nongatingtests.TunirNonGatingtestaudit -v
status: True

                  
test_audit (tunirtests.nongatingtests.TunirNonGatingtestaudit)
Tests audit ... ok

                  
----------------------------------------------------------------------
Ran 1 test in 0.448s

                  
OK

                  

                  

                  
command: ## sudo python3 -m unittest tunirtests.selinux.TestSELinux -v
status: True

                  
test_selinux (tunirtests.selinux.TestSELinux) ... ok

                  
----------------------------------------------------------------------
Ran 1 test in 0.037s

                  
OK

                  

                  

                  
command: ## sudo python3 -m unittest tunirtests.sshkeygentest.sshkeygenTest -v
status: True

                  
test_sshkeygen (tunirtests.sshkeygentest.sshkeygenTest)
This is a test case for ssh-keygen command. ... ok

                  
----------------------------------------------------------------------
Ran 1 test in 0.076s

                  
OK

                  

                  

                  
command: ## sudo python3 -m unittest tunirtests.testumountroot.TestUmountRoot -v
status: True

                  
test_umountroot (tunirtests.testumountroot.TestUmountRoot) ... ok

                  
----------------------------------------------------------------------
Ran 1 test in 0.027s

                  
OK

                  

                  

                  
command: sudo python3 -m unittest tunirtests.cloudtests.TestBase -v
status: False

                  
test_logging (tunirtests.cloudtests.TestBase)
Tests journald logging ... ok
test_packageinstall (tunirtests.cloudtests.TestBase)
Tests package install using dnf ... ok
test_selinux (tunirtests.cloudtests.TestBase)
Tests the SELinux ... ok
test_services (tunirtests.cloudtests.TestBase)
No service should fail in the startup. ... FAIL

                  
======================================================================
FAIL: test_services (tunirtests.cloudtests.TestBase)
No service should fail in the startup.
----------------------------------------------------------------------
Traceback (most recent call last):
  File "/home/fedora/tunirtests/cloudtests.py", line 26, in test_services
    self.assertIn('0 loaded units listed', out)
AssertionError: '0 loaded units listed' not found in "  UNIT         LOAD   ACTIVE SUB    DESCRIPTION                    \n? sssd.service loaded failed failed System Security Services Daemon\n\nLOAD   = Reflects whether the unit definition was properly loaded.\nACTIVE = The high-level unit activation state, i.e. generalization of SUB.\nSUB    = The low-level unit activation state, values depend on unit type.\n\n1 loaded units listed.\nTo show all installed unit files use 'systemctl list-unit-files'.\n"

                  
----------------------------------------------------------------------
Ran 4 tests in 34.399s

                  
FAILED (failures=1)

                  

                  

                  

                  

                  

                  
Non gating tests status:
Total:8
Passed:8
Failed:0
: WARNING: Image format was not specified for '/tmp/tmpiV0Ocu/seed.img' and probing guessed raw.
         Automatically detecting the format is dangerous for raw images, write operations on block 0 will be restricted.
         Specify the 'raw' format explicitly to remove the restrictions.
stty: 'standard input': Inappropriate ioctl for device