Compose ID Family Architecture Release Type Status Created Last updated Link
Fedora-29-updates-20190317.0 Atomic x86_64 29 qcow2 Success 2019-03-17 19:30:04 2019-03-17 19:40:35 Download Image
/usr/bin/qemu-kvm -m 2048 -smp 2 -drive file=/tmp/tmpoEWTgl/Fedora-AtomicHost-29-20190317.0.x86_64.qcow2,if=virtio -drive file=/tmp/tmpoEWTgl/seed.img,if=virtio -net bridge,br=virbr0 -net nic,macaddr=00:16:3e:3d:dd:8c,model=virtio -device virtio-rng-pci -display none
Successfully booted your local cloud image!
We will wait for 45 seconds for the image to boot up.
 
Executing command: sudo sh -c 'echo -e "\n10.5.126.23 infrastructure.fedoraproject.org\n10.5.125.44	pkgs.fedoraproject.org	pkgs\n10.5.126.51	download.fedora.redhat.com\n10.5.125.63	koji.fedoraproject.org\n10.5.126.51 mirrors.fedoraproject.org\n10.5.125.36	kojipkgs.fedoraproject.org" >> /etc/hosts'
Executing command: curl -O http://infrastructure.fedoraproject.org/infra/autocloud/tunirtests.tar.gz
Executing command: tar -xzvf tunirtests.tar.gz
Executing command: sudo python3 -m unittest tunirtests.atomictests.TestAtomic01Status -v
Executing command: ## sudo python3 -m unittest tunirtests.nongatingtests.TunirNonGatingtests -v
Executing command: ## sudo python3 -m unittest tunirtests.nongatingtests.TunirNonGatingtestBzip2 -v
Executing command: ## sudo python3 -m unittest tunirtests.nongatingtests.TunirNonGatingtestsCpio -v
Executing command: ## sudo python3 -m unittest tunirtests.nongatingtests.TunirNonGatingtestDiffutills -v
Executing command: ## sudo python3 -m unittest tunirtests.nongatingtests.TunirNonGatingtestaudit -v
Executing command: ## sudo python3 -m unittest tunirtests.selinux.TestSELinux -v
Executing command: ## sudo python3 -m unittest tunirtests.sshkeygentest.sshkeygenTest -v
Executing command: ## sudo python3 -m unittest tunirtests.testumountroot.TestUmountRoot -v
Executing command: sudo python3 -m unittest tunirtests.cloudtests.TestBase -v
Executing command: sudo python3 -m unittest tunirtests.cloudtests.TestCloudtmp -v
Executing command: sudo python3 -m unittest tunirtests.cloudtests.Testtmpmount -v
Executing command: sudo python3 -m unittest tunirtests.cloudtests.Testnetname -v
Executing command: ## python3 -m unittest tunirtests.cloudtests.TestJournalWritten -v
Executing command: sudo python3 -m unittest tunirtests.cloudservice.TestServiceStop -v
Executing command: sudo python3 -m unittest tunirtests.cloudservice.TestServiceDisable -v
Executing command: @@ sudo reboot
Polling for SSH connection
Polling for SSH connection
Executing command: ## sudo python3 -m unittest tunirtests.testreboot.TestReboot -v
Executing command: sudo python3 -m unittest tunirtests.cloudservice.TestServiceManipulation -v
Executing command: ## python3 -m unittest tunirtests.cloudtests.TestJournalWrittenAfterReboot -v
Executing command: @@ sudo reboot
Polling for SSH connection
Polling for SSH connection
Executing command: sudo python3 -m unittest tunirtests.cloudservice.TestServiceAfter -v
Executing command: sudo python3 -m unittest tunirtests.atomictests.TestDockerInstalled -v
Executing command: sudo python3 -m unittest tunirtests.atomictests.TestDockerStorageSetup -v
Executing command: sudo python3 -m unittest tunirtests.atomictests.TestAtomicFirstBootRun -v
Executing command: sudo python3 -m unittest tunirtests.atomictests.TestAtomicCommand -v
Executing command: sudo python3 -m unittest tunirtests.atomictests.TestAtomicDockerImage -v
Executing command: sudo python3 -m unittest tunirtests.atomictests.TestRootMount -v
Executing command: sudo python3 -m unittest tunirtests.atomictests.Testreadonlymount -v
Executing command: sudo python3 -m unittest tunirtests.atomictests.TestDockerDaemon -v

                  

                  
Job status: True

                  

                  
command: sudo sh -c 'echo -e "\n10.5.126.23 infrastructure.fedoraproject.org\n10.5.125.44	pkgs.fedoraproject.org	pkgs\n10.5.126.51	download.fedora.redhat.com\n10.5.125.63	koji.fedoraproject.org\n10.5.126.51 mirrors.fedoraproject.org\n10.5.125.36	kojipkgs.fedoraproject.org" >> /etc/hosts'
status: True

                  

                  

                  

                  
command: curl -O http://infrastructure.fedoraproject.org/infra/autocloud/tunirtests.tar.gz
status: True

                  
  % Total    % Received % Xferd  Average Speed   Time    Time     Time  Current
                                 Dload  Upload   Total   Spent    Left  Speed
  0     0    0     0    0     0      0      0 --:--:-- --:--:-- --:--:--     0
100 12885  100 12885    0     0  4194k      0 --:--:-- --:--:-- --:--:-- 4194k

                  

                  

                  
command: tar -xzvf tunirtests.tar.gz
status: True

                  
tunirtests/
tunirtests/atomictests.py
tunirtests/cloudservice.py
tunirtests/cloudtests.py
tunirtests/__init__.py
tunirtests/loopbacktest.py
tunirtests/nongatingtests.py
tunirtests/selinux.py
tunirtests/sshkeygentest.py
tunirtests/testreboot.py
tunirtests/testumountroot.py
tunirtests/testutils.py
tunirtests/vagranttests.py
tunirtests/LICENSE

                  

                  

                  
command: sudo python3 -m unittest tunirtests.atomictests.TestAtomic01Status -v
status: True

                  
test_print_status (tunirtests.atomictests.TestAtomic01Status)
Print the rpm-ostree status ... State: idle
AutomaticUpdates: disabled
Deployments:
 ostree://fedora-atomic:fedora/29/x86_64/atomic-host
                   Version: 29.20190317.0 (2019-03-17T07:51:33Z)
                    Commit: 676ac7acce4947db8d80d7222db8d34ebb32ed69d8b0afc9fadf9b2fb4004c61
              GPGSignature: Valid signature by 5A03B4DD8254ECA02FDA1637A20AA56B429476B4

                  
ok

                  
----------------------------------------------------------------------
Ran 1 test in 0.071s

                  
OK

                  

                  

                  
command: ## sudo python3 -m unittest tunirtests.nongatingtests.TunirNonGatingtests -v
status: True

                  
test_bash (tunirtests.nongatingtests.TunirNonGatingtests)
Tests the bash version as the same of upstream ... ok

                  
----------------------------------------------------------------------
Ran 1 test in 0.004s

                  
OK

                  

                  

                  
command: ## sudo python3 -m unittest tunirtests.nongatingtests.TunirNonGatingtestBzip2 -v
status: True

                  
test_bzip2 (tunirtests.nongatingtests.TunirNonGatingtestBzip2)
Test to run a file through bzip2,bzcat,bunzip2 ... ok

                  
----------------------------------------------------------------------
Ran 1 test in 0.015s

                  
OK

                  

                  

                  
command: ## sudo python3 -m unittest tunirtests.nongatingtests.TunirNonGatingtestsCpio -v
status: True

                  
test_cpio (tunirtests.nongatingtests.TunirNonGatingtestsCpio)
Tests to check basic cpio functions ... ok

                  
----------------------------------------------------------------------
Ran 1 test in 0.036s

                  
OK

                  

                  

                  
command: ## sudo python3 -m unittest tunirtests.nongatingtests.TunirNonGatingtestDiffutills -v
status: False

                  
test_cmp (tunirtests.nongatingtests.TunirNonGatingtestDiffutills)
Test to check cmp functionality ... FAIL

                  
======================================================================
FAIL: test_cmp (tunirtests.nongatingtests.TunirNonGatingtestDiffutills)
Test to check cmp functionality
----------------------------------------------------------------------
Traceback (most recent call last):
  File "/var/home/fedora/tunirtests/nongatingtests.py", line 99, in test_cmp
    self.assertIn(' line 1 is 170 x 163 s', out, out+err)
AssertionError: ' line 1 is 170 x 163 s' not found in '/var/tmp/diffutilsa /var/tmp/diffutilsb differ: byte 16, line 1 is  12 ^J 163 s\n' : /var/tmp/diffutilsa /var/tmp/diffutilsb differ: byte 16, line 1 is  12 ^J 163 s

                  

                  
----------------------------------------------------------------------
Ran 1 test in 0.018s

                  
FAILED (failures=1)

                  

                  

                  
command: ## sudo python3 -m unittest tunirtests.nongatingtests.TunirNonGatingtestaudit -v
status: True

                  
test_audit (tunirtests.nongatingtests.TunirNonGatingtestaudit)
Tests audit ... ok

                  
----------------------------------------------------------------------
Ran 1 test in 0.184s

                  
OK

                  

                  

                  
command: ## sudo python3 -m unittest tunirtests.selinux.TestSELinux -v
status: True

                  
test_selinux (tunirtests.selinux.TestSELinux) ... ok

                  
----------------------------------------------------------------------
Ran 1 test in 0.020s

                  
OK

                  

                  

                  
command: ## sudo python3 -m unittest tunirtests.sshkeygentest.sshkeygenTest -v
status: True

                  
test_sshkeygen (tunirtests.sshkeygentest.sshkeygenTest)
This is a test case for ssh-keygen command. ... ok

                  
----------------------------------------------------------------------
Ran 1 test in 0.084s

                  
OK

                  

                  

                  
command: ## sudo python3 -m unittest tunirtests.testumountroot.TestUmountRoot -v
status: True

                  
test_umountroot (tunirtests.testumountroot.TestUmountRoot) ... ok

                  
----------------------------------------------------------------------
Ran 1 test in 0.013s

                  
OK

                  

                  

                  
command: sudo python3 -m unittest tunirtests.cloudtests.TestBase -v
status: True

                  
test_logging (tunirtests.cloudtests.TestBase)
Tests journald logging ... ok
test_packageinstall (tunirtests.cloudtests.TestBase)
Tests package install using dnf ... skipped 'It is an Atomic image.'
test_selinux (tunirtests.cloudtests.TestBase)
Tests the SELinux ... ok
test_services (tunirtests.cloudtests.TestBase)
No service should fail in the startup. ... ok

                  
----------------------------------------------------------------------
Ran 4 tests in 0.069s

                  
OK (skipped=1)

                  

                  

                  
command: sudo python3 -m unittest tunirtests.cloudtests.TestCloudtmp -v
status: True

                  
test_write_tmp (tunirtests.cloudtests.TestCloudtmp)
/tmp should always be writable. ... ok

                  
----------------------------------------------------------------------
Ran 1 test in 0.002s

                  
OK

                  

                  

                  
command: sudo python3 -m unittest tunirtests.cloudtests.Testtmpmount -v
status: True

                  
test_tmp_mount (tunirtests.cloudtests.Testtmpmount) ... ok

                  
----------------------------------------------------------------------
Ran 1 test in 0.004s

                  
OK

                  

                  

                  
command: sudo python3 -m unittest tunirtests.cloudtests.Testnetname -v
status: True

                  
test_net_name (tunirtests.cloudtests.Testnetname) ... ok

                  
----------------------------------------------------------------------
Ran 1 test in 0.005s

                  
OK

                  

                  

                  
command: ## python3 -m unittest tunirtests.cloudtests.TestJournalWritten -v
status: True

                  
test_journal_written (tunirtests.cloudtests.TestJournalWritten) ... ok

                  
----------------------------------------------------------------------
Ran 1 test in 0.054s

                  
OK

                  

                  

                  
command: sudo python3 -m unittest tunirtests.cloudservice.TestServiceStop -v
status: True

                  
test_service (tunirtests.cloudservice.TestServiceStop) ... ok

                  
----------------------------------------------------------------------
Ran 1 test in 0.025s

                  
OK

                  

                  

                  
command: sudo python3 -m unittest tunirtests.cloudservice.TestServiceDisable -v
status: True

                  
test_service (tunirtests.cloudservice.TestServiceDisable) ... ok

                  
----------------------------------------------------------------------
Ran 1 test in 0.239s

                  
OK

                  

                  

                  
command: @@ sudo reboot
status: True

                  

                  

                  

                  
command: ## sudo python3 -m unittest tunirtests.testreboot.TestReboot -v
status: True

                  
test_lastreboot (tunirtests.testreboot.TestReboot)
Checks for system reboot. ... ok

                  
----------------------------------------------------------------------
Ran 1 test in 0.010s

                  
OK

                  

                  

                  
command: sudo python3 -m unittest tunirtests.cloudservice.TestServiceManipulation -v
status: True

                  
test_service (tunirtests.cloudservice.TestServiceManipulation)
Tests the service. ... ok

                  
----------------------------------------------------------------------
Ran 1 test in 0.394s

                  
OK

                  

                  

                  
command: ## python3 -m unittest tunirtests.cloudtests.TestJournalWrittenAfterReboot -v
status: True

                  
test_journal_written_after_reboot (tunirtests.cloudtests.TestJournalWrittenAfterReboot) ... ok

                  
----------------------------------------------------------------------
Ran 1 test in 0.052s

                  
OK

                  

                  

                  
command: sudo python3 -m unittest tunirtests.cloudservice.TestServiceAfter -v
status: True

                  
test_service (tunirtests.cloudservice.TestServiceAfter)
Tests the service. ... ok

                  
----------------------------------------------------------------------
Ran 1 test in 0.273s

                  
OK

                  

                  

                  
command: sudo python3 -m unittest tunirtests.atomictests.TestDockerInstalled -v
status: True

                  
test_run (tunirtests.atomictests.TestDockerInstalled) ... ok

                  
----------------------------------------------------------------------
Ran 1 test in 0.041s

                  
OK

                  

                  

                  
command: sudo python3 -m unittest tunirtests.atomictests.TestDockerStorageSetup -v
status: True

                  
test_journalctl_logs (tunirtests.atomictests.TestDockerStorageSetup)
Test journalctl logs for docker-storage-setup ... 'Starting Docker Storage Setup...\nNOCHANGE: partition 2 could only be grown by -33 [fudge=2048]\n  Physical volume "/dev/vda2" changed\n  1 physical volume(s) resized or updated / 0 physical volume(s) not resized\n  Size of logical volume atomicos/root unchanged from <5.00 GiB (1279 extents).\n  Logical volume atomicos/root successfully resized.\nStarted Docker Storage Setup.\nStarting Docker Storage Setup...\nNOCHANGE: partition 2 could only be grown by -33 [fudge=2048]\n  Physical volume "/dev/vda2" changed\n  1 physical volume(s) resized or updated / 0 physical volume(s) not resized\n  Size of logical volume atomicos/root unchanged from <5.00 GiB (1279 extents).\n  Logical volume atomicos/root successfully resized.\nStarted Docker Storage Setup.\nStarting Docker Storage Setup...\nNOCHANGE: partition 2 could only be grown by -33 [fudge=2048]\n  Physical volume "/dev/vda2" changed\n  1 physical volume(s) resized or updated / 0 physical volume(s) not resized\n  Size of logical volume atomicos/root unchanged from <5.00 GiB (1279 extents).\n  Logical volume atomicos/root successfully resized.\nStarted Docker Storage Setup.\n'
ok
test_lsblk_output (tunirtests.atomictests.TestDockerStorageSetup)
Test output for lsblk ... ok

                  
----------------------------------------------------------------------
Ran 2 tests in 0.041s

                  
OK

                  

                  

                  
command: sudo python3 -m unittest tunirtests.atomictests.TestAtomicFirstBootRun -v
status: True

                  
test_docker_image_run (tunirtests.atomictests.TestAtomicFirstBootRun) ... ok

                  
----------------------------------------------------------------------
Ran 1 test in 3.430s

                  
OK

                  

                  

                  
command: sudo python3 -m unittest tunirtests.atomictests.TestAtomicCommand -v
status: True

                  
test_atomic_command (tunirtests.atomictests.TestAtomicCommand) ... ok

                  
----------------------------------------------------------------------
Ran 1 test in 15.333s

                  
OK

                  

                  

                  
command: sudo python3 -m unittest tunirtests.atomictests.TestAtomicDockerImage -v
status: True

                  
test_docker_image (tunirtests.atomictests.TestAtomicDockerImage) ... ok

                  
----------------------------------------------------------------------
Ran 1 test in 23.095s

                  
OK

                  

                  

                  
command: sudo python3 -m unittest tunirtests.atomictests.TestRootMount -v
status: True

                  
test_root_mount (tunirtests.atomictests.TestRootMount) ... ok

                  
----------------------------------------------------------------------
Ran 1 test in 0.418s

                  
OK

                  

                  

                  
command: sudo python3 -m unittest tunirtests.atomictests.Testreadonlymount -v
status: True

                  
test_read_only (tunirtests.atomictests.Testreadonlymount)
Tests the read only dirs. ... ok

                  
----------------------------------------------------------------------
Ran 1 test in 0.001s

                  
OK

                  

                  

                  
command: sudo python3 -m unittest tunirtests.atomictests.TestDockerDaemon -v
status: True

                  
test_docker (tunirtests.atomictests.TestDockerDaemon) ... ok

                  
----------------------------------------------------------------------
Ran 1 test in 11.125s

                  
OK

                  

                  

                  

                  

                  

                  
Non gating tests status:
Total:11
Passed:10
Failed:1